I am getting BUILD FAILURE. please help me with that.

BUILD FAILURE
[INFO] ————————————————————————
[INFO] Total time: 3.263 s
[INFO] Finished at: 2017-11-18T11:59:32+05:30
[INFO] Final Memory: 7M/18M
[INFO] ————————————————————————
[ERROR] Failed to execute goal org.apache.maven.plugins:maven-compiler-plugin:3.7.0:compile (default-compile) on project OnlineStore: Compilation failure
[ERROR] No compiler is provided in this environment. Perhaps you are running on a JRE rather than a JDK?
[ERROR] -> [Help 1]
[ERROR]
[ERROR] To see the full stack trace of the errors, re-run Maven with the -e switch.
[ERROR] Re-run Maven using the -X switch to enable full debug logging.
[ERROR]

Default Asked on November 18, 2017 in Program QA Automation.
Add Comment
  • 0 Answer(s)
  • Your Answer

    By posting your answer, you agree to the privacy policy and terms of service.